Selesai

Install OpenCV3.2 on my server - I have attempted it an it has a compile error! 10 Min job!

Projek ini berjaya disempurnakan oleh itgold untuk £23 GBP dalam hari.

Dapatkan sebut harga percuma untuk projek seperti ini
Bajet Projek
£10 - £20 GBP
Diselesaikan Dalam
1 hari
Jumlah Bida
3
Penerangan Projek

Hi there - I have been having major problems building and compiling OpenCV on my server. I need to use python (2.7) with it .

+_+_+_+_+_+_+_+_+_ ERROR START +_+_+_+_+_+_+_+_+_+_+_+_+_+

[ 12%] Built target pch_Generate_opencv_perf_stitching

[ 12%] Generating [url removed, login to view], [url removed, login to view]

Scanning dependencies of target opencv_core

[ 12%] Building CXX object modules/core/CMakeFiles/[url removed, login to view]

c++: internal compiler error: Segmentation fault (program cc1plus)

Please submit a full bug report,

with preprocessed source if appropriate.

See <file:///usr/share/doc/gcc-5/[url removed, login to view]> for instructions.

modules/core/CMakeFiles/[url removed, login to view]:90: recipe for target 'modules/core/CMakeFiles/[url removed, login to view]' failed

make[2]: *** [modules/core/CMakeFiles/[url removed, login to view]] Error 4

CMakeFiles/Makefile2:1096: recipe for target 'modules/core/CMakeFiles/[url removed, login to view]' failed

make[1]: *** [modules/core/CMakeFiles/[url removed, login to view]] Error 2

make[1]: *** Waiting for unfinished jobs....

[ 12%] Built target pch_Generate_opencv_videostab

Makefile:160: recipe for target 'all' failed

make: *** [all] Error 2

+_+_+_+_+_+_+_+_+_+_+_+_+_+_+_+_+_+_+_+_+_+_+

I need someone to install it and document it please....

If you can 100% do this please apply.

Cheers.

Diselesaikan oleh:

Mencari untuk memperoleh sedikit wang?

  • Tetapkan bajet anda dan tempoh masa
  • Rangkakan cadangan anda
  • Dibayar untuk kerja anda

Upah Freelancer yang juga membida projek ini

    • Forbes
    • The New York Times
    • Time
    • Wall Street Journal
    • Times Online